{"text_format":"1","workbook":"xlsx","n_sheets":10,"sheets":["חשוב","xlookup  בתוך  xlookup","xlookup + xlookup","search X 3","רגישות סדר 1","רגישות סדר 1 DMIN","חתירה למטרה minIfs","סינון ומיון דינמיים","שם משתמש וסיסמה","חשוב ביותר"],"not_rendered":{"charts":0,"images":11,"macros":1,"external_links":4,"defined_names":13,"comments":3,"pivot_tables":0},"unopened":[],"bounds":{"document_bytes":16777216,"sheet_cells":100000,"rows_first":2000,"rows_last":500,"rows_between":2000,"halvings":0,"cell_chars":16384,"cell_head_chars":4096},"cells_cut":0,"cells_raw":0,"read":"whole","date_system":"1900"}

{"sheet":"חשוב","index":0,"n_rows":0,"n_cols":0,"rows_kept":0,"cut":false,"hidden":false,"merged":[]}

{"sheet":"xlookup  בתוך  xlookup","index":1,"n_rows":52,"n_cols":18,"rows_kept":52,"cut":false,"hidden":false,"merged":[[1,7,2,16],[8,10,8,15],[31,0,33,15]]}
["מעמד לקוח","תחילת ההשקעה","סכום השקעה ","מספר קרן","ערך השקעה נכון להיום","ערך ההשקעה בשקלים",null,null,null,null,null,null,null,null,null,null,null,"ערך ההשקעה בשקלים"]
["שכיר","2022-09-15",2500,10,16761.877886011072,{"$f":"(E2-_xlfn.XLOOKUP(A2,$L$25:$L$27,_xlfn.XLOOKUP(D2,$M$24:$Q$24,$M$25:$Q$27))*E2)*$K$21","v":45206.784658571865},null,"חוק: בכל פעם שנקבל טבלה עם קטגוריות בשורות ובעמודות (דומה לריבוע הקסם) נעבוד עם XLOOKUP בתוך XLOOKUP",null,null,null,null,null,null,null,null,null,{"$f":"(Q2-(_xlfn.XLOOKUP(L2,$Q$13:$Q$15,_xlfn.XLOOKUP(O2,$R$12:$V$12,$R$13:$V$15)))*Q2)*$N$4","v":45206.784658571865}]
["עצמאי","2022-03-12",146726,13,214094.11260178176,{"$f":"(E3-_xlfn.XLOOKUP(A3,$L$25:$L$27,_xlfn.XLOOKUP(D3,$M$24:$Q$24,$M$25:$Q$27))*E3)*$K$21","v":530953.39925241878},null,null,null,null,null,null,null,null,null,null,null,{"$f":"(Q3-(_xlfn.XLOOKUP(L3,$Q$13:$Q$15,_xlfn.XLOOKUP(O3,$R$12:$V$12,$R$13:$V$15)))*Q3)*$N$4","v":530953.39925241878}]
["שכיר","2022-09-29",253094,10,307637.33883750002,{"$f":"(E4-_xlfn.XLOOKUP(A4,$L$25:$L$27,_xlfn.XLOOKUP(D4,$M$24:$Q$24,$M$25:$Q$27))*E4)*$K$21","v":829697.90284473763},null,null,null,null,null,null,null,null,null,null,null,{"$f":"(Q4-(_xlfn.XLOOKUP(L4,$Q$13:$Q$15,_xlfn.XLOOKUP(O4,$R$12:$V$12,$R$13:$V$15)))*Q4)*$N$4","v":829697.90284473763}]
["שכיר","2022-12-29",70131,14,332458.09982047207,{"$f":"(E5-_xlfn.XLOOKUP(A5,$L$25:$L$27,_xlfn.XLOOKUP(D5,$M$24:$Q$24,$M$25:$Q$27))*E5)*$K$21","v":917251.89740468236},null,null,null,null,null,null,null,null,null,null,null,{"$f":"(Q5-(_xlfn.XLOOKUP(L5,$Q$13:$Q$15,_xlfn.XLOOKUP(O5,$R$12:$V$12,$R$13:$V$15)))*Q5)*$N$4","v":917251.89740468236}]
["שכיר","2022-02-05",63372,15,1229261.9753939065,{"$f":"(E6-_xlfn.XLOOKUP(A6,$L$25:$L$27,_xlfn.XLOOKUP(D6,$M$24:$Q$24,$M$25:$Q$27))*E6)*$K$21","v":3429640.911348999},null,null,null,null,null,null,null,null,null,null,null,{"$f":"(Q6-(_xlfn.XLOOKUP(L6,$Q$13:$Q$15,_xlfn.XLOOKUP(O6,$R$12:$V$12,$R$13:$V$15)))*Q6)*$N$4","v":3429640.911348999}]
["עצמאי","2022-05-19",72483,15,1877660.4186721272,{"$f":"(E7-_xlfn.XLOOKUP(A7,$L$25:$L$27,_xlfn.XLOOKUP(D7,$M$24:$Q$24,$M$25:$Q$27))*E7)*$K$21","v":4947635.2032010555},null,null,null,null,null,null,null,null,null,null,null,{"$f":"(Q7-(_xlfn.XLOOKUP(L7,$Q$13:$Q$15,_xlfn.XLOOKUP(O7,$R$12:$V$12,$R$13:$V$15)))*Q7)*$N$4","v":4947635.2032010555}]
["עצמאי","2022-07-11",108877,13,986671.12314671697,{"$f":"(E8-_xlfn.XLOOKUP(A8,$L$25:$L$27,_xlfn.XLOOKUP(D8,$M$24:$Q$24,$M$25:$Q$27))*E8)*$K$21","v":2446944.385403858},null,null,null,null,null,null,null,null,null,null,null,{"$f":"(Q8-(_xlfn.XLOOKUP(L8,$Q$13:$Q$15,_xlfn.XLOOKUP(O8,$R$12:$V$12,$R$13:$V$15)))*Q8)*$N$4","v":2446944.385403858}]
{"$rows_left_out":45}
{"sheet":"xlookup + xlookup","index":2,"n_rows":59,"n_cols":26,"rows_kept":59,"cut":false,"hidden":false,"merged":[[1,24,1,25],[11,24,11,25]]}
["שם פרטי לקוח","שם משפחה לקוח","כתובת דוא\"ל","תאריך הרכישה","שעת הרכישה","דגם הרכב ","סיווג הרכב","שם הסוכנות","מיקום הסוכנות","תאריך עליית הרכב לכביש","מחיר יבואן ","מספר ק\"מ ","שם משתמש","סיסמה","מחיר רכישה",null,null,"תוספת סיווג","אחוזXמחיר יבואן","אחוז ממחיר יבואן","שם החברה","מיקום קו תחתון"]
["יוסי","שמעון","ELVLSUAM@colman.ac.il","2022-08-02","17:10:35","Mazda_6","פרטי","רכבי דניאלס","יהוד","2010-06-29",132100,53490,{"$f":"MID(B2,'[2]נתוני עזר'!$A$10,'[2]נתוני עזר'!$A$11)&'[2]נתוני עזר'!$A$12&TEXT(D2,\"MMM\")","v":"מע#אוג"},{"$f":"LEN(C2)&LEFT(F2,'[2]נתוני עזר'!$A$15)&HOUR(E2)","v":"21Maz17"},{"$f":"S2+R2","v":92570},null,{"$f":"_xlfn.XLOOKUP(LEFT(F2,SEARCH($Y$21,F2)-$Y$22),$Z$4:$Z$8,$Y$4:$Y$8,$Z$10)*K2+_xlfn.XLOOKUP(G2,$Z$14:$Z$17,$Y$14:$Y$17)/MINUTE(E2)","v":92570},{"$f":"_xlfn.XLOOKUP(G2,$Z$14:$Z$17,$Y$14:$Y$17)/MINUTE(E2)","v":100},{"$f":"T2*K2","v":92470},{"$f":"_xlfn.XLOOKUP(LEFT(F2,SEARCH($Y$21,F2)-$Y$22),$Z$4:$Z$8,$Y$4:$Y$8,$Z$10)","v":0.7},{"$f":"LEFT(F2,SEARCH($Y$21,F2)-$Y$22)","v":"Mazda"},{"$f":"SEARCH($Y$21,F2)","v":6},null,null,"טבלה מס' 1"]
["נטע","פוקס","KEZZLDMD@colman.ac.il","2022-05-03","19:16:55","Mazda_6","פרטי","גלגלי הזהב","חולון","2011-03-29",132100,25829,{"$f":"MID(B3,'[2]נתוני עזר'!$A$10,'[2]נתוני עזר'!$A$11)&'[2]נתוני עזר'!$A$12&TEXT(D3,\"MMM\")","v":"וק#מאי"},{"$f":"LEN(C3)&LEFT(F3,'[2]נתוני עזר'!$A$15)&HOUR(E3)","v":"21Maz19"},{"$f":"S3+R3","v":92532.5},null,{"$f":"_xlfn.XLOOKUP(LEFT(F3,SEARCH($Y$21,F3)-$Y$22),$Z$4:$Z$8,$Y$4:$Y$8,$Z$10)*K3+_xlfn.XLOOKUP(G3,$Z$14:$Z$17,$Y$14:$Y$17)/MINUTE(E3)","v":92532.5},{"$f":"_xlfn.XLOOKUP(G3,$Z$14:$Z$17,$Y$14:$Y$17)/MINUTE(E3)","v":62.5},{"$f":"T3*K3","v":92470},{"$f":"_xlfn.XLOOKUP(LEFT(F3,SEARCH($Y$21,F3)-$Y$22),$Z$4:$Z$8,$Y$4:$Y$8,$Z$10)","v":0.7},{"$f":"LEFT(F3,SEARCH($Y$21,F3)-$Y$22)","v":"Mazda"},{"$f":"SEARCH($Y$21,F3)","v":6},null,null,"אחוז ממחיר יבואן","סוג רכב"]
["אורי","גוזמן","BEXLDPPA11@ynet.co.il","2022-02-19","17:20:28.333","Citroen_C3","פרטי","רכב דיל מאיר","חיפה","2011-01-15",125000,65509,{"$f":"MID(B4,'[2]נתוני עזר'!$A$10,'[2]נתוני עזר'!$A$11)&'[2]נתוני עזר'!$A$12&TEXT(D4,\"MMM\")","v":"וז#פבר"},{"$f":"LEN(C4)&LEFT(F4,'[2]נתוני עזר'!$A$15)&HOUR(E4)","v":"21Cit17"},68800,null,68800,50,68750,0.55000000000000004,"Citroen",8,null,null,0.6,"Nissan"]
["אורן","ברבור","COZ66@walla.co.il","2022-06-28","17:09:30.994","Honda_Civic","פרטי","גלגלי הזהב","חולון","2009-05-24",119200,31704,{"$f":"MID(B5,'[2]נתוני עזר'!$A$10,'[2]נתוני עזר'!$A$11)&'[2]נתוני עזר'!$A$12&TEXT(D5,\"MMM\")","v":"רב#יונ"},{"$f":"LEN(C5)&LEFT(F5,'[2]נתוני עזר'!$A$15)&HOUR(E5)","v":"17Hon17"},53751.111111111109,null,53751.111111111109,111.11111111111111,53640,0.45,"Honda",6,null,null,0.7,"Mazda"]
["אבי ","ברלב","SVET6@walla.co.il","2022-11-08","19:35:47.084","Citroen_C5","פרטי","גלגלי הזהב","חולון","2010-10-04",114500,28286,{"$f":"MID(B6,'[2]נתוני עזר'!$A$10,'[2]נתוני עזר'!$A$11)&'[2]נתוני עזר'!$A$12&TEXT(D6,\"MMM\")","v":"רל#נוב"},{"$f":"LEN(C6)&LEFT(F6,'[2]נתוני עזר'!$A$15)&HOUR(E6)","v":"17Cit19"},63003.571428571435,null,63003.571428571435,28.571428571428573,62975.000000000007,0.55000000000000004,"Citroen",8,null,null,0.8,"BMW"]
["נוי","סליקטר","VWQXYKIY@colman.ac.il","2022-05-07","18:16:10","Mazda_3","פרטי","סוכנות המוביל","תל אביב","2011-04-03",99200,99037,{"$f":"MID(B7,'[2]נתוני עזר'!$A$10,'[2]נתוני עזר'!$A$11)&'[2]נתוני עזר'!$A$12&TEXT(D7,\"MMM\")","v":"לי#מאי"},{"$f":"LEN(C7)&LEFT(F7,'[2]נתוני עזר'!$A$15)&HOUR(E7)","v":"21Maz18"},69502.5,null,69502.5,62.5,69440,0.7,"Mazda",6,null,null,0.75,"Audi"]
["אמיר","שרון","AUTBPAME@ynet.co.il","2022-09-15","16:07:25","BMW_Z4","פרטי","סוכנות המוביל","תל אביב","2011-08-11",185200,23650,{"$f":"MID(B8,'[2]נתוני עזר'!$A$10,'[2]נתוני עזר'!$A$11)&'[2]נתוני עזר'!$A$12&TEXT(D8,\"MMM\")","v":"רו#ספט"},{"$f":"LEN(C8)&LEFT(F8,'[2]נתוני עזר'!$A$15)&HOUR(E8)","v":"19BMW16"},148302.85714285713,null,148302.85714285713,142.85714285714286,148160,0.8,"BMW",4,null,null,0.55000000000000004,"Citroen"]
{"$rows_left_out":52}
{"sheet":"search X 3","index":3,"n_rows":27,"n_cols":17,"rows_kept":27,"cut":false,"hidden":false,"merged":[]}
["מספר לקוח","שם לקוח","כתובת דוא\"ל","מעמד לקוח","תחילת ההשקעה","סכום השקעה ","מספר קרן","דמי ניהול ","ערך השקעה נכון להיום",null,"סיסמה",null,"ההפרש יגלה את אורך השרת שבאמצע","חיפוש מיקום התו @","חיפוש מיקום התו ."]
[1855,"NI_IAV","NI_IAV@colman.ac.il","שכיר","2022-09-15",2500,10,8.9999999999999993E-3,16761.877886011072,null,{"$f":"MID(C2,N2+$Q$7,M2-$Q$7)&DAY(E2)","v":"colman15"},null,{"$f":"O2-N2","v":7},{"$f":"SEARCH($Q$9,C2)","v":7},{"$f":"SEARCH($Q$8,C2)","v":14}]
[1856,"KF_GLD","KF_GLD@colman.ac.il","עצמאי","2022-03-12",146726,13,2.8999999999999998E-3,214094.11260178176,null,{"$f":"MID(C3,N3+$Q$7,M3-$Q$7)&DAY(E3)","v":"colman12"},null,{"$f":"O3-N3","v":7},{"$f":"SEARCH($Q$9,C3)","v":7},{"$f":"SEARCH($Q$8,C3)","v":14}]
[1857,"CC_GB","CC_GB@hotmail.com","שכיר","2022-09-29",253094,10,6.0000000000000001E-3,307637.33883750002,null,"hotmail29",null,8,6,14]
[1858,"BJ_VLS","BJ_VLS@colman.ac.il","שכיר","2022-12-29",70131,14,1E-3,332458.09982047207,null,"colman29",null,7,7,14]
[1859,"DE_APS","DE_APS@hotmail.com","שכיר","2022-02-05",63372,15,1E-3,1229261.9753939065,null,"hotmail5",null,8,7,15,null,"תאי עזר"]
[1860,"BJ_DDX","BJ_DDX@colman.ac.il","עצמאי","2022-05-19",72483,15,1E-3,1877660.4186721272,null,"colman19",null,7,7,14,null,1]
[1861,"CK_UUE","CK_UUE@ynet.co.il","עצמאי","2022-07-11",108877,13,2.8999999999999998E-3,986671.12314671697,null,"ynet11",null,5,7,{"$f":"SEARCH($Q$8,C8)","v":12},null,"."]
{"$rows_left_out":20}
{"sheet":"רגישות סדר 1","index":4,"n_rows":81,"n_cols":20,"rows_kept":81,"cut":false,"hidden":false,"merged":[[45,0,45,4]]}
["מספר לקוח","שם פרטי","שם משפחה","כתובת אימייל","מספר טלפון נייד","עיר מגורים","תאריך הצטרפות למועדון לקוחות","מוצר מועדף","סיווג המוצר","רמת שביעות רצון מהשירות","סכום קנייה ממוצעת","ממוצע מספר היחידות בהזמנה","שעת ביצוע ההזמנה","שעת קבלת המשלוח","שם משתמש ","סיסמה ","סיווג לקוח","הנחה","עלות משלוח"]
[1,"אבי","שחר","avi@hotmail.com","053-2223333","תל אביב","2014-03-22","Palermo Kaza","קפסולות קפה",7,320,7,"16:30:00","17:15:00",{"$f":"LEFT(B2,Q1A_1)&MID(C2,Q1A_3,Q1A_1)&Q1A_KRIA&DAY(G2)","v":"אר!22"},{"$f":"LEN(I2)&RIGHT(H2,Q1A_2)&HOUR(M2)","v":"11za16"},{"$f":"_xlfn.XLOOKUP(K2,'[1]נתוני עזר'!$C$3:$C$6,'[1]נתוני עזר'!$D$3:$D$6,,-1)","v":"חברים לקפה"},{"$f":"_xlfn.XLOOKUP(L2,$A$48:$A$51,_xlfn.XLOOKUP(I2,$B$47:$D$47,$B$48:$D$51),,-1)*K2","v":6.4},{"$f":"IF(AND(I2=$N$55,L2<$P$55),$P$55*L2,IF(AND(F2=$N$58,HOUR(M2)>$P$56),$P$56*L2,$P$57*L2))","v":112}]
[2,"אביב","גור","aviv@gov.il","053-1112222","ירושלים","2013-04-11","Altission","קפסולות קפה",7,1200,17,"16:15:00","17:00:00",{"$f":"LEFT(B3,Q1A_1)&MID(C3,Q1A_3,Q1A_1)&Q1A_KRIA&DAY(G3)","v":"אר!11"},{"$f":"LEN(I3)&RIGHT(H3,Q1A_2)&HOUR(M3)","v":"11on16"},{"$f":"_xlfn.XLOOKUP(K3,'[1]נתוני עזר'!$C$3:$C$6,'[1]נתוני עזר'!$D$3:$D$6,,-1)","v":"כוכבי קפה "},{"$f":"_xlfn.XLOOKUP(L3,$A$48:$A$51,_xlfn.XLOOKUP(I3,$B$47:$D$47,$B$48:$D$51),,-1)*K3","v":60},{"$f":"IF(AND(I3=$N$55,L3<$P$55),$P$55*L3,IF(AND(F3=$N$58,HOUR(M3)>$P$56),$P$56*L3,$P$57*L3))","v":272}]
[3,"אורן","כהן","oren@gmail.com","050-4445555","רמת גן","2013-12-01","Ispirazione Napolion","קפסולות קפה",2,200,9,"14:30:00","15:15:00",{"$f":"LEFT(B4,Q1A_1)&MID(C4,Q1A_3,Q1A_1)&Q1A_KRIA&DAY(G4)","v":"אן!1"},{"$f":"LEN(I4)&RIGHT(H4,Q1A_2)&HOUR(M4)","v":"11on14"},{"$f":"_xlfn.XLOOKUP(K4,'[1]נתוני עזר'!$C$3:$C$6,'[1]נתוני עזר'!$D$3:$D$6,,-1)","v":"טעימות קפה"},{"$f":"_xlfn.XLOOKUP(L4,$A$48:$A$51,_xlfn.XLOOKUP(I4,$B$47:$D$47,$B$48:$D$51),,-1)*K4","v":4},{"$f":"IF(AND(I4=$N$55,L4<$P$55),$P$55*L4,IF(AND(F4=$N$58,HOUR(M4)>$P$56),$P$56*L4,$P$57*L4))","v":144}]
[4,"איליה","קליין","ilia@gmail.com","053-1234567","חיפה","2016-09-14","Vertuo Ne","מכונות קפה",7,600,17,"15:30:00","16:15:00",{"$f":"LEFT(B5,Q1A_1)&MID(C5,Q1A_3,Q1A_1)&Q1A_KRIA&DAY(G5)","v":"אי!14"},{"$f":"LEN(I5)&RIGHT(H5,Q1A_2)&HOUR(M5)","v":"10Ne15"},{"$f":"_xlfn.XLOOKUP(K5,'[1]נתוני עזר'!$C$3:$C$6,'[1]נתוני עזר'!$D$3:$D$6,,-1)","v":"מומחי קפה"},{"$f":"_xlfn.XLOOKUP(L5,$A$48:$A$51,_xlfn.XLOOKUP(I5,$B$47:$D$47,$B$48:$D$51),,-1)*K5","v":36},272]
[5,"אילן","רון","ilan@hotmail.com","053-9998888","רעננה","2016-04-25","Sccuro","קפסולות קפה",6,700,17,"17:00:00","17:45:00",{"$f":"LEFT(B6,Q1A_1)&MID(C6,Q1A_3,Q1A_1)&Q1A_KRIA&DAY(G6)","v":"אן!25"},{"$f":"LEN(I6)&RIGHT(H6,Q1A_2)&HOUR(M6)","v":"11ro17"},{"$f":"_xlfn.XLOOKUP(K6,'[1]נתוני עזר'!$C$3:$C$6,'[1]נתוני עזר'!$D$3:$D$6,,-1)","v":"מומחי קפה"},{"$f":"_xlfn.XLOOKUP(L6,$A$48:$A$51,_xlfn.XLOOKUP(I6,$B$47:$D$47,$B$48:$D$51),,-1)*K6","v":35},272]
[6,"אלון","פלג","alon@gmail.com","052-6667777","נתניה","2013-07-16","זוג ספלי קפוצ'ינו ","אביזרים נלווים",7,600,17,"12:45:00","13:30:00",{"$f":"LEFT(B7,Q1A_1)&MID(C7,Q1A_3,Q1A_1)&Q1A_KRIA&DAY(G7)","v":"אג!16"},{"$f":"LEN(I7)&RIGHT(H7,Q1A_2)&HOUR(M7)","v":"14ו 12"},{"$f":"_xlfn.XLOOKUP(K7,'[1]נתוני עזר'!$C$3:$C$6,'[1]נתוני עזר'!$D$3:$D$6,,-1)","v":"מומחי קפה"},{"$f":"_xlfn.XLOOKUP(L7,$A$48:$A$51,_xlfn.XLOOKUP(I7,$B$47:$D$47,$B$48:$D$51),,-1)*K7","v":24},272]
[7,"אלונה","רובינוביץ","alona@yahoo.com","053-5556666","אילת","2016-10-08","Odacioo","קפסולות קפה",7,500,14,"18:15:00","19:00:00",{"$f":"LEFT(B8,Q1A_1)&MID(C8,Q1A_3,Q1A_1)&Q1A_KRIA&DAY(G8)","v":"אב!8"},{"$f":"LEN(I8)&RIGHT(H8,Q1A_2)&HOUR(M8)","v":"11oo18"},{"$f":"_xlfn.XLOOKUP(K8,'[1]נתוני עזר'!$C$3:$C$6,'[1]נתוני עזר'!$D$3:$D$6,,-1)","v":"חברים לקפה"},{"$f":"_xlfn.XLOOKUP(L8,$A$48:$A$51,_xlfn.XLOOKUP(I8,$B$47:$D$47,$B$48:$D$51),,-1)*K8","v":15},224]
{"$rows_left_out":74}
{"sheet":"רגישות סדר 1 DMIN","index":5,"n_rows":57,"n_cols":26,"rows_kept":57,"cut":false,"hidden":false,"merged":[[1,19,1,20],[11,19,11,20],[24,16,28,16]]}
["שם פרטי לקוח","שם משפחה לקוח","כתובת דוא\"ל","תאריך הרכישה","שעת הרכישה","דגם הרכב ","סיווג הרכב","שם הסוכנות","מיקום הסוכנות","תאריך עליית הרכב לכביש","מחיר יבואן ","מספר ק\"מ ","שם משתמש","סיסמה","מחיר רכישה"]
["יוסי","שמעון","ELVLSUAM@colman.ac.il","2022-08-02","17:10:35","Mazda_6","פרטי","רכבי דניאלס","יהוד","2010-06-29",132100,53490,{"$f":"MID(B2,'[3]נתוני עזר'!$A$10,'[3]נתוני עזר'!$A$11)&'[3]נתוני עזר'!$A$12&TEXT(D2,\"MMM\")","v":"מע#אוג"},{"$f":"LEN(C2)&LEFT(F2,'[3]נתוני עזר'!$A$15)&HOUR(E2)","v":"21Maz17"},{"$f":"_xlfn.XLOOKUP(LEFT(F2,SEARCH('[3]נתוני עזר'!$A$24,'[4]ניתוח רגישות'!F2)-'[3]נתוני עזר'!$A$25),$U$4:$U$8,$T$4:$T$8,$U$10)*K2+_xlfn.XLOOKUP(G2,$U$14:$U$17,$T$14:$T$17)/MINUTE(E2)","v":92570},null,null,null,null,"טבלה מס' 1"]
["נטע","פוקס","KEZZLDMD@colman.ac.il","2022-05-03","19:16:55","Mazda_6","פרטי","גלגלי הזהב","חולון","2011-03-29",132100,25829,{"$f":"MID(B3,'[3]נתוני עזר'!$A$10,'[3]נתוני עזר'!$A$11)&'[3]נתוני עזר'!$A$12&TEXT(D3,\"MMM\")","v":"וק#מאי"},{"$f":"LEN(C3)&LEFT(F3,'[3]נתוני עזר'!$A$15)&HOUR(E3)","v":"21Maz19"},{"$f":"_xlfn.XLOOKUP(LEFT(F3,SEARCH('[3]נתוני עזר'!$A$24,'[4]ניתוח רגישות'!F3)-'[3]נתוני עזר'!$A$25),$U$4:$U$8,$T$4:$T$8,$U$10)*K3+_xlfn.XLOOKUP(G3,$U$14:$U$17,$T$14:$T$17)/MINUTE(E3)","v":92532.5},null,null,null,null,"אחוז ממחיר יבואן","סוג רכב"]
["אורי","גוזמן","BEXLDPPA11@ynet.co.il","2022-02-19","17:20:28.333","Citroen_C3","פרטי","רכב דיל מאיר","חיפה","2011-01-15",125000,65509,{"$f":"MID(B4,'[3]נתוני עזר'!$A$10,'[3]נתוני עזר'!$A$11)&'[3]נתוני עזר'!$A$12&TEXT(D4,\"MMM\")","v":"וז#פבר"},{"$f":"LEN(C4)&LEFT(F4,'[3]נתוני עזר'!$A$15)&HOUR(E4)","v":"21Cit17"},{"$f":"_xlfn.XLOOKUP(LEFT(F4,SEARCH('[3]נתוני עזר'!$A$24,'[4]ניתוח רגישות'!F4)-'[3]נתוני עזר'!$A$25),$U$4:$U$8,$T$4:$T$8,$U$10)*K4+_xlfn.XLOOKUP(G4,$U$14:$U$17,$T$14:$T$17)/MINUTE(E4)","v":68800},null,null,null,null,0.6,"Nissan"]
["אורן","ברבור","COZ66@walla.co.il","2022-06-28","17:09:30.994","Honda_Civic","פרטי","גלגלי הזהב","חולון","2009-05-24",119200,31704,{"$f":"MID(B5,'[3]נתוני עזר'!$A$10,'[3]נתוני עזר'!$A$11)&'[3]נתוני עזר'!$A$12&TEXT(D5,\"MMM\")","v":"רב#יונ"},{"$f":"LEN(C5)&LEFT(F5,'[3]נתוני עזר'!$A$15)&HOUR(E5)","v":"17Hon17"},{"$f":"_xlfn.XLOOKUP(LEFT(F5,SEARCH('[3]נתוני עזר'!$A$24,'[4]ניתוח רגישות'!F5)-'[3]נתוני עזר'!$A$25),$U$4:$U$8,$T$4:$T$8,$U$10)*K5+_xlfn.XLOOKUP(G5,$U$14:$U$17,$T$14:$T$17)/MINUTE(E5)","v":53751.111111111109},null,null,null,null,0.7,"Mazda"]
["אבי ","ברלב","SVET6@walla.co.il","2022-11-08","19:35:47.084","Citroen_C5","פרטי","גלגלי הזהב","חולון","2010-10-04",114500,28286,{"$f":"MID(B6,'[3]נתוני עזר'!$A$10,'[3]נתוני עזר'!$A$11)&'[3]נתוני עזר'!$A$12&TEXT(D6,\"MMM\")","v":"רל#נוב"},{"$f":"LEN(C6)&LEFT(F6,'[3]נתוני עזר'!$A$15)&HOUR(E6)","v":"17Cit19"},{"$f":"_xlfn.XLOOKUP(LEFT(F6,SEARCH('[3]נתוני עזר'!$A$24,'[4]ניתוח רגישות'!F6)-'[3]נתוני עזר'!$A$25),$U$4:$U$8,$T$4:$T$8,$U$10)*K6+_xlfn.XLOOKUP(G6,$U$14:$U$17,$T$14:$T$17)/MINUTE(E6)","v":63003.571428571435},null,null,null,null,0.8,"BMW"]
["נוי","סליקטר","VWQXYKIY@colman.ac.il","2022-05-07","18:16:10","Mazda_3","פרטי","סוכנות המוביל","תל אביב","2011-04-03",99200,99037,{"$f":"MID(B7,'[3]נתוני עזר'!$A$10,'[3]נתוני עזר'!$A$11)&'[3]נתוני עזר'!$A$12&TEXT(D7,\"MMM\")","v":"לי#מאי"},{"$f":"LEN(C7)&LEFT(F7,'[3]נתוני עזר'!$A$15)&HOUR(E7)","v":"21Maz18"},{"$f":"_xlfn.XLOOKUP(LEFT(F7,SEARCH('[3]נתוני עזר'!$A$24,'[4]ניתוח רגישות'!F7)-'[3]נתוני עזר'!$A$25),$U$4:$U$8,$T$4:$T$8,$U$10)*K7+_xlfn.XLOOKUP(G7,$U$14:$U$17,$T$14:$T$17)/MINUTE(E7)","v":69502.5},null,null,null,null,0.75,"Audi"]
["אמיר","שרון","AUTBPAME@ynet.co.il","2022-09-15","16:07:25","BMW_Z4","פרטי","סוכנות המוביל","תל אביב","2011-08-11",185200,23650,{"$f":"MID(B8,'[3]נתוני עזר'!$A$10,'[3]נתוני עזר'!$A$11)&'[3]נתוני עזר'!$A$12&TEXT(D8,\"MMM\")","v":"רו#ספט"},{"$f":"LEN(C8)&LEFT(F8,'[3]נתוני עזר'!$A$15)&HOUR(E8)","v":"19BMW16"},{"$f":"_xlfn.XLOOKUP(LEFT(F8,SEARCH('[3]נתוני עזר'!$A$24,'[4]ניתוח רגישות'!F8)-'[3]נתוני עזר'!$A$25),$U$4:$U$8,$T$4:$T$8,$U$10)*K8+_xlfn.XLOOKUP(G8,$U$14:$U$17,$T$14:$T$17)/MINUTE(E8)","v":148302.85714285713},null,null,null,null,0.55000000000000004,"Citroen"]
{"$rows_left_out":50}
{"sheet":"חתירה למטרה minIfs","index":6,"n_rows":41,"n_cols":23,"rows_kept":41,"cut":false,"hidden":false,"merged":[[27,16,27,20],[27,3,27,8]]}
["מספר לקוח","שם לקוח","כתובת דוא\"ל","מעמד לקוח","תחילת ההשקעה","סכום השקעה ","מספר קרן","דמי ניהול ","ערך השקעה נכון להיום","ערך השקעה נכון להיום בש\"ח"]
[1855,"NI_IAV","NI_IAV@colman.ac.il","שכיר","2022-09-15",2500,10,8.9999999999999993E-3,16761.877886011072,{"$f":"I2*$M$2","v":410891.59859707026},null,null,24.513458539152541,"שער הדולר שנתון"]
[1856,"KF_GLD","KF_GLD@colman.ac.il","עצמאי","2022-03-12",146726,13,2.8999999999999998E-3,214094.11260178176,{"$f":"I3*$M$2","v":5248187.1527404329}]
[1857,"CC_GB","CC_GB@hotmail.com","שכיר","2022-09-29",253094,10,6.0000000000000001E-3,307637.33883750002,7541255.1506882785]
[1858,"BJ_VLS","BJ_VLS@colman.ac.il","שכיר","2022-12-29",70131,14,1E-3,332458.09982047207,8149697.8459545793]
[1859,"DE_APS","DE_APS@hotmail.com","שכיר","2022-02-05",63372,15,1E-3,1229261.9753939065,30133462.467575278]
[1860,"BJ_DDX","BJ_DDX@colman.ac.il","עצמאי","2022-05-19",72483,15,1E-3,1877660.4186721272,46027950.823726989]
[1861,"CK_UUE","CK_UUE@ynet.co.il","עצמאי","2022-07-11",108877,13,2.8999999999999998E-3,986671.12314671697,24186721.669036116]
{"$rows_left_out":34}
{"sheet":"סינון ומיון דינמיים","index":7,"n_rows":59,"n_cols":23,"rows_kept":59,"cut":false,"hidden":false,"merged":[[0,14,0,22],[46,14,46,18],[46,1,46,7]]}
["מספר לקוח","שם לקוח","כתובת דוא\"ל","מעמד לקוח","תחילת ההשקעה","סכום השקעה בדולר ","מספר קרן","דמי ניהול ","ערך השקעה נכון להיום",null,null,null,null,null,"תוצאות הסינון הדינאמי, שאלה 3 סעיף ג"]
[1855,"NI_IAV","NI_IAV@colman.ac.il","שכיר","2022-09-15",2500,10,8.9999999999999993E-3,16761.877886011072,null,null,null,null,null,{"$f":"_xlfn._xlws.SORT(_xlfn._xlws.FILTER(A2:I26,(F2:F26>$G$36)+(D2:D26=$G$37)*(H2:H26>=$G$38)*(H2:H26<=$F$38)),U52,N52)","v":1859},"KK_ZJH","KK_ZJH@colman.ac.il","עצמאי",44593,10129,14,1.1000000000000001E-3,22812.44860458418]
[1856,"KF_GLD","KF_GLD@colman.ac.il","עצמאי","2022-03-12",146726,12,2.8999999999999998E-3,214094.11260178176,null,null,null,null,null,1863,"DJ_IPO","DJ_IPO@yahoo.com","עצמאי",44861,66590,15,1E-3,377756.68354481296]
[1855,"CC_GB","CC_GB@hotmail.com","שכיר","2022-09-29",253094,10,6.0000000000000001E-3,307637.33883750002,null,null,null,null,null,1873,"EL_NGQ","EL_NGQ@ynet.co.il","עצמאי",44743,71270,13,3.8999999999999998E-3,142479.52031448073]
[1858,"BJ_VLS","BJ_VLS@colman.ac.il","שכיר","2022-12-29",70131,13,1E-3,332458.09982047207,null,null,null,null,null,1860,"BJ_DDX","BJ_DDX@colman.ac.il","עצמאי",44700,72483,15,1E-3,1877660.4186721272]
[1859,"DE_APS","DE_APS@hotmail.com","שכיר","2022-02-05",63372,15,1E-3,1229261.9753939065,null,null,null,null,null,1861,"CK_UUE","CK_UUE@ynet.co.il","עצמאי",44753,108877,13,2.8999999999999998E-3,986671.12314671697]
[1860,"BJ_DDX","BJ_DDX@colman.ac.il","עצמאי","2022-05-19",72483,15,1E-3,1877660.4186721272,null,null,null,null,null,1856,"KF_GLD","KF_GLD@colman.ac.il","עצמאי",44632,146726,12,2.8999999999999998E-3,214094.11260178176]
[1861,"CK_UUE","CK_UUE@ynet.co.il","עצמאי","2022-07-11",108877,13,2.8999999999999998E-3,986671.12314671697,null,null,null,null,null,1855,"CC_GB","CC_GB@hotmail.com","שכיר",44833,253094,10,6.0000000000000001E-3,307637.33883750002]
{"$rows_left_out":52}
{"sheet":"שם משתמש וסיסמה","index":8,"n_rows":57,"n_cols":21,"rows_kept":57,"cut":false,"hidden":false,"merged":[[1,19,1,20],[11,19,11,20],[20,17,20,19],[27,17,27,19]]}
["שם פרטי לקוח","שם משפחה לקוח","כתובת דוא\"ל","תאריך הרכישה","שעת הרכישה","דגם הרכב ","סיווג הרכב","שם הסוכנות","מיקום הסוכנות","תאריך עליית הרכב לכביש","מחיר יבואן ","מספר ק\"מ ","שם משתמש","סיסמה"]
["אאוגן ","ליבוביץ","ELVLSUAM@colman.ac.il","2022-08-02","17:10:35","Mazda_6","פרטי","רכבי דניאלס","יהוד","2010-06-29",132100,53490,{"$f":"MID(B2,$S$22,$S$23)&$S$24&TEXT(D2,\"mmm\")","v":"יב#אוג"},{"$f":"LEN(C2)&LEFT(F2,$S$30)&MINUTE(E2)","v":"21Maz10"},null,null,null,{"$f":"RIGHT(C2,$R$36)=$R$35","v":true},null,"טבלה מס' 1"]
["אאוג'ן ","מנוליאו","KEZZLDMD@colman.ac.il","2022-05-03","19:16:55","Mazda_6","פרטי","גלגלי הזהב","חולון","2011-03-29",132100,25829,"נו#מאי","21Maz16",null,null,null,{"$f":"RIGHT(C3,$R$36)=$R$35","v":true},null,"אחוז ממחיר יבואן","סוג רכב"]
["אאוריקה ","גורכוב","BEXLDPPA11@ynet.co.il","2022-02-19","17:20:28.333","Citroen_C3","פרטי","רכב דיל מאיר","חיפה","2011-01-15",125000,65509,"ור#פבר","21Cit20",null,null,null,true,null,0.6,"Nissan"]
["אאוריקה ","יאסין","COZ66@walla.co.il","2022-06-28","17:09:30.994","Honda_Civic","פרטי","גלגלי הזהב","חולון","2009-05-24",119200,31704,"אס#יונ","17Hon9",null,null,null,true,null,0.7,"Mazda"]
["יוסי","שמעון","SVET6@walla.co.il","2022-11-08","19:35:47.084","Citroen_C5","פרטי","גלגלי הזהב","חולון","2010-10-04",114500,28286,"מע#נוב","17Cit35",null,null,null,true,null,0.8,"BMW"]
["דן","טננבאום","VWQXYKIY@colman.ac.il","2022-05-07","18:16:10","Mazda_3","פרטי","סוכנות המוביל","תל אביב","2011-04-03",99200,99037,"ננ#מאי","21Maz16",null,null,null,true,null,0.75,"Audi"]
["רם","אברמוביץ","AUTBPAME@ynet.co.il","2022-09-15","16:07:25","BMW_Z4","פרטי","סוכנות המוביל","תל אביב","2011-08-11",185200,23650,"בר#ספט","19BMW7",null,null,null,true,null,0.55000000000000004,"Citroen"]
{"$rows_left_out":50}
{"sheet":"חשוב ביותר","index":9,"n_rows":0,"n_cols":0,"rows_kept":0,"cut":false,"hidden":false,"merged":[]}